Jump to content


Photo
- - - - -

[Linux Compiling] Compiling NON-CVS on LINUX (like Yurots, Neverland..) UPDATED 30/03


  • Please log in to reply
158 replies to this topic

#141 Guest_jurrian_*

Posted 13 September 2006 - 10:31 PM
Guest_jurrian_*
  • Guests
  • Reputation: 0

Can someone help me with this error:

g++ -I. -I/usr/include/libxml2 -I/usr/include/lua50 -D__linux__ -DTLM_BUY_SELL -DTLM_SERVER_SAVE -DTLM_HOUSE_SYSTEM -DBDB_UTEVO_LUX -DWOLV_LOAD_NPC -DBD_HOUSE_WINDOW -DTR_ANTI_AFK -DELEM_VIP_LIST -DTR_SUMMONS -DTRS_GM_INVISIBLE -DTLM_SKULLS_PARTY -DBRN_EXIVA -DSD_BURST_ARROW -DBDB_REPLACE_SPEARS -DBD_ITEM_LOOK -DSM_RELOAD_CONFIG -DJD_DEATH_LIST -DCT_EXANI_TERA -DCVS_DAY_CYCLE -DTJ_MONSTER_BLOOD -DJD_WANDS -D__DEBUG_PLAYERS__ -DYUR_CVS_MODS -DYUR_ICE_RAPIER -DYUR_AOL -DYUR_LOGIN_QUEUE -DYUR_MULTIPLIERS -DYUR_BOH -DYUR_NPC_EXT -DYUR_GUILD_SYSTEM -DYUR_CMD_EXT -DYUR_ITEM_EXT -DYUR_ACT_EXT -DYUR_NO_MONSTER_HEAL -DYUR_PVP_ARENA -DYUR_RINGS_AMULETS -DYUR_CONFIG_CAP -DYUR_FIGHT_MODE -DYUR_READABLES -DYUR_LEARN_SPELLS -DYUR_HEAL_EXHAUST -DYUR_SHUTDOWN -DYUR_ROOKGARD -DYUR_LIGHT_ITEM -DYUR_CLEAN_MAP -DYUR_GM_LOOK -DYUR_PREMIUM_PROMOTION -DYUR_INVISIBLE -DYUR_DRAINS -DBD_FOLLOW -DANTI_MISS -DRAIDS -DSELL_CONTAINER -DMARRIAGE -DVOTE -DLUCK -DEXANI_HUR -DEXETA_RES -DEXANA_POX -DNPC_TURNING -DBUYHOUSE -DCHANGE_SEX -DBLACK_SQUARE -DMOVE_UP -DEXANA_ANI -DDJIN -DBD_CONDITION -DBD_DOWN -DTLM_BEDS -DRUL_WALKTO -DSG_PARCEL -DADVANCE_ANI -DWEAPON_EFECT -DLOOSIK_RECORD -DANTI_LURE -DADD_TELEPORT -DMAGIC_UP -DGM_WINDOW -DPARCEL_FLOOR -DPARALYZE -DGET_SLOT -DGIVEEXP -Werror -g -O2 -c ioaccountxml.cpp
ioaccountxml.cpp: In member function 'virtual bool IOAccountXML::saveAccount(Account)':
ioaccountxml.cpp:211: error: 'floor' was not declared in this scope
make: *** [ioaccountxml.o] Error 1

thnx a lot

#142 Thomac

Posted 13 September 2006 - 10:42 PM
Thomac

    Donator

  • Members
  • PipPipPipPipPip
  • Reputation: 146
    Excellent
  • 1,492 posts

Write "using namespace std;" near the top of ioaccountxml.cpp. (After the includes)

#143 Guest_jurrian_*

Posted 14 September 2006 - 03:06 PM
Guest_jurrian_*
  • Guests
  • Reputation: 0

Write "using namespace std;" near the top of ioaccountxml.cpp. (After the includes)


I did, i get this error right now:

DGIVEEXP -Werror -g -O2 -c ioaccountxml.cpp
ioaccountxml.cpp: In member function âvirtual Account IOAccountXML::loadAccount(long unsigned int)â:
ioaccountxml.cpp:46: fout: no matching function for call to âtransform(__gnu_cxx::__normal_iterator<char*, std::basic_string<char, std::char_traits<char>, std::allocator<char> > >, __gnu_cxx::__normal_iterator<char*, std::basic_string<char, std::char_traits<char>, std::allocator<char> > >, __gnu_cxx::__normal_iterator<char*, std::basic_string<char, std::char_traits<char>, std::allocator<char> > >, <unknown type>)â
ioaccountxml.cpp: In member function âvirtual bool IOAccountXML::getPassword(long unsigned int, const std::string&, std::string&)â:
ioaccountxml.cpp:128: fout: no matching function for call to âtransform(__gnu_cxx::__normal_iterator<char*, std::basic_string<char, std::char_traits<char>, std::allocator<char> > >, __gnu_cxx::__normal_iterator<char*, std::basic_string<char, std::char_traits<char>, std::allocator<char> > >, __gnu_cxx::__normal_iterator<char*, std::basic_string<char, std::char_traits<char>, std::allocator<char> > >, <unknown type>)â
ioaccountxml.cpp: In member function âvirtual bool IOAccountXML::saveAccount(Account)â:
ioaccountxml.cpp:194: fout: no matching function for call to âtransform(__gnu_cxx::__normal_iterator<char*, std::basic_string<char, std::char_traits<char>, std::allocator<char> > >, __gnu_cxx::__normal_iterator<char*, std::basic_string<char, std::char_traits<char>, std::allocator<char> > >, __gnu_cxx::__normal_iterator<char*, std::basic_string<char, std::char_traits<char>, std::allocator<char> > >, <unknown type>)â
ioaccountxml.cpp:212: fout: âfloorâ was not declared in this scope
make: *** [ioaccountxml.o] Fout 1

#144 Socks-5

Posted 14 September 2006 - 08:52 PM
Socks-5

    Resigned nublet eater

  • Members
  • PipPipPipPipPip
  • Reputation: 10
    Good
  • 1,277 posts

Notice all the "â"'s?
You got something messed up with ur code :P (probarbly linebreaks)
In the End, we will remember not the words of our enemies, but the silence of our friends.

#145 Guest_lewer_*

Posted 02 October 2006 - 07:30 PM
Guest_lewer_*
  • Guests
  • Reputation: 0

it is not working on pld ;/
BUT I WILL DO IT
i wont use wine -.-

#146 anxur

Posted 13 October 2006 - 10:28 AM
anxur

    New User

  • Members
  • PipPip
  • Reputation: 10
    Good
  • 15 posts

there is

[imax@rackmex otserv]$ make
make all-am
make[1]: Entering directory `/home/imax/otserv'
if g++ -DHAVE_CONFIG_H -I. -I. -I. -I/usr/include/libxml2 -D_THREAD_SAFE -D_REENTRANT -Werror -g -O2 -MT commands.o -MD -MP -MF ".deps/commands.Tpo" -c -o commands.o commands.cpp; \
then mv -f ".deps/commands.Tpo" ".deps/commands.Po"; else rm -f ".deps/commands.Tpo"; exit 1; fi
commands.cpp: In member function 'bool Commands::serverInfo(Creature*, const std::string&, const std::string&)':
commands.cpp:1199: error: 'class ConfigManager' has no member named 'getWeaponString'
commands.cpp:1200: error: 'class ConfigManager' has no member named 'getManaString'
make[1]: *** [commands.o] Error 1
make[1]: Leaving directory `/home/imax/otserv'
make: *** [all] Error 2

#147 Socks-5

Posted 19 October 2006 - 09:40 PM
Socks-5

    Resigned nublet eater

  • Members
  • PipPipPipPipPip
  • Reputation: 10
    Good
  • 1,277 posts

Currently theres no guide for compiling evolutions(to my knowledge) but u should check out the linux forum, think they got a ongoing discussion about it :>.
In the End, we will remember not the words of our enemies, but the silence of our friends.

#148 Marble

Posted 21 October 2006 - 06:01 AM
Marble

    New User

  • Members
  • PipPipPipPip
  • Reputation: 15
    Good
  • 65 posts

Currently theres no guide for compiling evolutions(to my knowledge) but u should check out the linux forum, think they got a ongoing discussion about it :>.


If you follow this tutorial and all the hints in this thread you don't need an other tutorial to compile evolutions for Linux ;)

Proglin did a good job to show us how to do it!

//Marble

PS: All my posts have been restored in Linux forum! Please continue Linux issues there.

#149 Marble

Posted 21 October 2006 - 10:53 PM
Marble

    New User

  • Members
  • PipPipPipPip
  • Reputation: 15
    Good
  • 65 posts

To compile Evolutions (any versions)
I will add some useful information here:
If your compiler complains about
_atoi64 change to atoll
__int64 change to long long
Sleep() change to OTSYS_SLEEP() or usleep(seconds*1000)

That was quite simple, wasn't it?

//Marble

#150 Junkfood

Posted 25 October 2006 - 05:03 PM
Junkfood

    Full Member

  • Members
  • PipPipPipPipPip
  • Reputation: 407
    Fantastic
  • 1,667 posts
  • Location:Europe, Netherlands

NOOOOOO!

Just use uint64_t instead of all those at**

#151 Marble

Posted 25 October 2006 - 08:25 PM
Marble

    New User

  • Members
  • PipPipPipPip
  • Reputation: 15
    Good
  • 65 posts

NOOOOOO!

Just use uint64_t instead of all those at**


Never tried uint64_t before :D
As it works perfectly with at** the first time. I don't bother to fix anything that works! (I'm too lazy you know!)

So seriously, tell us what the difference are between uint64_t and those at**s, maybe we can learn something :)

(I expect you to say: Try Google!)

//Marble

#152 Guest_Adiko_*

Posted 27 December 2006 - 09:41 PM
Guest_Adiko_*
  • Guests
  • Reputation: 0

[root@localhost otserv]# make
g++ -I. -I/usr/include/libxml2  -I/usr/include/lua50 -D__linux__ -DUCB_AUTO_RESTART -DUCB_LVL_EXP -DYUR_LEARN_SPELLS -DCVS_DAY_CYCLE -DTLM_BUY_SELL -DTLM_SERVER_SAVE -DYUR_ROOKGARD -DTLM_HOUSE_SYSTEM -DBDB_UTEVO_LUX -DWOLV_LOAD_NPC -DBD_HOUSE_WINDOW -DTR_ANTI_AFK -DELEM_VIP_LIST -DTR_SUMMONS -DTRS_GM_INVISIBLE -DTLM_SKULLS_PARTY -DBRN_EXIVA -DSD_BURST_ARROW -DBDB_REPLACE_SPEARS -DBD_ITEM_LOOK -DSM_RELOAD_CONFIG -DJD_DEATH_LIST -DCT_EXANI_TERA -DTJ_MONSTER_BLOOD -DJD_WANDS -D__DEBUG_PLAYERS__ -DYUR_CVS_MODS -DYUR_ICE_RAPIER -DYUR_AOL -DYUR_LOGIN_QUEUE -DYUR_MULTIPLIERS -DYUR_BOH -DYUR_NPC_EXT -DYUR_GUILD_SYSTEM -DYUR_CMD_EXT -DYUR_ITEM_EXT -DYUR_ACT_EXT -DYUR_NO_MONSTER_HEAL -DYUR_PVP_ARENA -DYUR_RINGS_AMULETS -DYUR_CONFIG_CAP -DYUR_FIGHT_MODE -DYUR_READABLES -DYUR_HEAL_EXHAUST -DYUR_SHUTDOWN -DYUR_LIGHT_ITEM -DYUR_CLEAN_MAP -DYUR_GM_LOOK -DYUR_PREMIUM_PROMOTION -DYUR_INVISIBLE -DYUR_DRAINS -DEM_HUR_UP_DOWN -DPVTMSG -DJERO_PROTECTION -D__EXCEPTION_TRACER___ -Werror -g -O2 -c account.cpp
g++ -I. -I/usr/include/libxml2  -I/usr/include/lua50 -D__linux__ -DUCB_AUTO_RESTART -DUCB_LVL_EXP -DYUR_LEARN_SPELLS -DCVS_DAY_CYCLE -DTLM_BUY_SELL -DTLM_SERVER_SAVE -DYUR_ROOKGARD -DTLM_HOUSE_SYSTEM -DBDB_UTEVO_LUX -DWOLV_LOAD_NPC -DBD_HOUSE_WINDOW -DTR_ANTI_AFK -DELEM_VIP_LIST -DTR_SUMMONS -DTRS_GM_INVISIBLE -DTLM_SKULLS_PARTY -DBRN_EXIVA -DSD_BURST_ARROW -DBDB_REPLACE_SPEARS -DBD_ITEM_LOOK -DSM_RELOAD_CONFIG -DJD_DEATH_LIST -DCT_EXANI_TERA -DTJ_MONSTER_BLOOD -DJD_WANDS -D__DEBUG_PLAYERS__ -DYUR_CVS_MODS -DYUR_ICE_RAPIER -DYUR_AOL -DYUR_LOGIN_QUEUE -DYUR_MULTIPLIERS -DYUR_BOH -DYUR_NPC_EXT -DYUR_GUILD_SYSTEM -DYUR_CMD_EXT -DYUR_ITEM_EXT -DYUR_ACT_EXT -DYUR_NO_MONSTER_HEAL -DYUR_PVP_ARENA -DYUR_RINGS_AMULETS -DYUR_CONFIG_CAP -DYUR_FIGHT_MODE -DYUR_READABLES -DYUR_HEAL_EXHAUST -DYUR_SHUTDOWN -DYUR_LIGHT_ITEM -DYUR_CLEAN_MAP -DYUR_GM_LOOK -DYUR_PREMIUM_PROMOTION -DYUR_INVISIBLE -DYUR_DRAINS -DEM_HUR_UP_DOWN -DPVTMSG -DJERO_PROTECTION -D__EXCEPTION_TRACER___ -Werror -g -O2 -c actions.cpp
In file included from tile.h:33,
                 from map.h:35,
                 from player.h:32,
                 from actions.cpp:24:
scheduler.h:25:30: error: boost/function.hpp: Nie ma takiego pliku ani katalogu
scheduler.h:26:26: error: boost/bind.hpp: Nie ma takiego pliku ani katalogu
fileloader.h:79: error: extra qualification ‘FileLoader::’ on member ‘writeData’
item.h:122: error: extra qualification ‘Item::’ on member ‘getText’
luascript.h:161: error: extra qualification ‘LuaScript::’ on member ‘setField’
scheduler.h:72: error: ‘boost’ has not been declared
scheduler.h:72: error: expected `)' before ‘<’ token
scheduler.h:82: error: ‘boost’ has not been declared
scheduler.h:82: error: ISO C++ forbids declaration of ‘function1’ with no type
scheduler.h:82: error: expected ‘;’ before ‘<’ token
scheduler.h: In member function ‘virtual void TSchedulerTask::operator()(Game*)’:
scheduler.h:76: error: ‘_f’ was not declared in this scope
scheduler.h: At global scope:
scheduler.h:85: error: ‘boost’ has not been declared
scheduler.h:85: error: expected primary-expression before ‘void’
scheduler.h:85: error: expected primary-expression before ‘*’ token
scheduler.h:85: error: expected primary-expression before ‘>’ token
scheduler.h:85: error: ‘f’ was not declared in this scope
scheduler.h:85: error: initializer expression list treated as compound expression
scheduler.h:86: error: ‘boost’ has not been declared
scheduler.h:86: error: expected ‘,’ or ‘...’ before ‘<’ token
scheduler.h:86: error: ‘SchedulerTask* makeTask(__int64, int)’ redeclared as different kind of symbol
scheduler.h:85: error: previous declaration of ‘SchedulerTask* makeTask’
game.h:523: error: ‘boost’ has not been declared
game.h:523: error: expected `)' before ‘<’ token
game.h:543: error: ‘boost’ has not been declared
game.h:543: error: ISO C++ forbids declaration of ‘function’ with no type
game.h:543: error: expected ‘;’ before ‘<’ token
game.h:544: error: ‘boost’ has not been declared
game.h:544: error: ISO C++ forbids declaration of ‘function’ with no type
game.h:544: error: expected ‘;’ before ‘<’ token
game.h: In member function ‘void TCallList<ArgType>::operator()(Game*)’:
game.h:528: error: there are no arguments to ‘_f2’ that depend on a template parameter, so a declaration of ‘_f2’ must be available
game.h:528: error: (if you use ‘-fpermissive’, G++ will accept your code, but allowing the use of an undeclared name is deprecated)
game.h:532: error: ‘_f1’ was not declared in this scope
game.h:532: error: ‘_f2’ was not declared in this scope
game.h: At global scope:
game.h:550: error: ‘boost’ has not been declared
game.h:550: error: expected ‘,’ or ‘...’ before ‘<’ token
game.h:550: error: ‘template<class ArgType> SchedulerTask* makeTask(__int64, int)’ redeclared as different kind of symbol
scheduler.h:85: error: previous declaration of ‘SchedulerTask* makeTask’
game.h: In function ‘SchedulerTask* makeTask(__int64, int)’:
game.h:551: error: ‘f1’ was not declared in this scope
game.h:551: error: ‘f2’ was not declared in this scope
game.h:551: error: ‘call_list’ was not declared in this scope
game.h:551: error: ‘interval’ was not declared in this scope
make: *** [actions.o] Błąd 1
[root@localhost otserv]# make
g++ -I. -I/usr/include/libxml2  -I/usr/include/lua50 -D__linux__ -DUCB_AUTO_RESTART -DUCB_LVL_EXP -DYUR_LEARN_SPELLS -DCVS_DAY_CYCLE -DTLM_BUY_SELL -DTLM_SERVER_SAVE -DYUR_ROOKGARD -DTLM_HOUSE_SYSTEM -DBDB_UTEVO_LUX -DWOLV_LOAD_NPC -DBD_HOUSE_WINDOW -DTR_ANTI_AFK -DELEM_VIP_LIST -DTR_SUMMONS -DTRS_GM_INVISIBLE -DTLM_SKULLS_PARTY -DBRN_EXIVA -DSD_BURST_ARROW -DBDB_REPLACE_SPEARS -DBD_ITEM_LOOK -DSM_RELOAD_CONFIG -DJD_DEATH_LIST -DCT_EXANI_TERA -DTJ_MONSTER_BLOOD -DJD_WANDS -D__DEBUG_PLAYERS__ -DYUR_CVS_MODS -DYUR_ICE_RAPIER -DYUR_AOL -DYUR_LOGIN_QUEUE -DYUR_MULTIPLIERS -DYUR_BOH -DYUR_NPC_EXT -DYUR_GUILD_SYSTEM -DYUR_CMD_EXT -DYUR_ITEM_EXT -DYUR_ACT_EXT -DYUR_NO_MONSTER_HEAL -DYUR_PVP_ARENA -DYUR_RINGS_AMULETS -DYUR_CONFIG_CAP -DYUR_FIGHT_MODE -DYUR_READABLES -DYUR_HEAL_EXHAUST -DYUR_SHUTDOWN -DYUR_LIGHT_ITEM -DYUR_CLEAN_MAP -DYUR_GM_LOOK -DYUR_PREMIUM_PROMOTION -DYUR_INVISIBLE -DYUR_DRAINS -DEM_HUR_UP_DOWN -DPVTMSG -DJERO_PROTECTION -D__EXCEPTION_TRACER___ -Werror -g -O2 -c actions.cpp
In file included from tile.h:33,
                 from map.h:35,
                 from player.h:32,
                 from actions.cpp:24:
scheduler.h:25:30: error: boost/function.hpp: Nie ma takiego pliku ani katalogu
scheduler.h:26:26: error: boost/bind.hpp: Nie ma takiego pliku ani katalogu
In file included from actions.cpp:26:
mypatch.h:15:7: error: no newline at end of file
fileloader.h:79: error: extra qualification ‘FileLoader::’ on member ‘writeData’
item.h:122: error: extra qualification ‘Item::’ on member ‘getText’
luascript.h:161: error: extra qualification ‘LuaScript::’ on member ‘setField’
scheduler.h:72: error: ‘boost’ has not been declared
scheduler.h:72: error: expected `)' before ‘<’ token
scheduler.h:82: error: ‘boost’ has not been declared
scheduler.h:82: error: ISO C++ forbids declaration of ‘function1’ with no type
scheduler.h:82: error: expected ‘;’ before ‘<’ token
scheduler.h: In member function ‘virtual void TSchedulerTask::operator()(Game*)’:
scheduler.h:76: error: ‘_f’ was not declared in this scope
scheduler.h: At global scope:
scheduler.h:85: error: ‘boost’ has not been declared
scheduler.h:85: error: expected primary-expression before ‘void’
scheduler.h:85: error: expected primary-expression before ‘*’ token
scheduler.h:85: error: expected primary-expression before ‘>’ token
scheduler.h:85: error: ‘f’ was not declared in this scope
scheduler.h:85: error: initializer expression list treated as compound expression
scheduler.h:86: error: ‘boost’ has not been declared
scheduler.h:86: error: expected ‘,’ or ‘...’ before ‘<’ token
scheduler.h:86: error: ‘SchedulerTask* makeTask(__int64, int)’ redeclared as different kind of symbol
scheduler.h:85: error: previous declaration of ‘SchedulerTask* makeTask’
game.h:523: error: ‘boost’ has not been declared
game.h:523: error: expected `)' before ‘<’ token
game.h:543: error: ‘boost’ has not been declared
game.h:543: error: ISO C++ forbids declaration of ‘function’ with no type
game.h:543: error: expected ‘;’ before ‘<’ token
game.h:544: error: ‘boost’ has not been declared
game.h:544: error: ISO C++ forbids declaration of ‘function’ with no type
game.h:544: error: expected ‘;’ before ‘<’ token
game.h: In member function ‘void TCallList<ArgType>::operator()(Game*)’:
game.h:528: error: there are no arguments to ‘_f2’ that depend on a template parameter, so a declaration of ‘_f2’ must be available
game.h:528: error: (if you use ‘-fpermissive’, G++ will accept your code, but allowing the use of an undeclared name is deprecated)
game.h:532: error: ‘_f1’ was not declared in this scope
game.h:532: error: ‘_f2’ was not declared in this scope
game.h: At global scope:
game.h:550: error: ‘boost’ has not been declared
game.h:550: error: expected ‘,’ or ‘...’ before ‘<’ token
game.h:550: error: ‘template<class ArgType> SchedulerTask* makeTask(__int64, int)’ redeclared as different kind of symbol
scheduler.h:85: error: previous declaration of ‘SchedulerTask* makeTask’
game.h: In function ‘SchedulerTask* makeTask(__int64, int)’:
game.h:551: error: ‘f1’ was not declared in this scope
game.h:551: error: ‘f2’ was not declared in this scope
game.h:551: error: ‘call_list’ was not declared in this scope
game.h:551: error: ‘interval’ was not declared in this scope
make: *** [actions.o] Błąd 1

?????????????

Edited by Iyashii, 27 March 2010 - 01:56 PM.
Added [code]


#153 Proglin

Posted 12 January 2007 - 10:28 AM
Proglin

    An old man

  • Members
  • PipPipPipPipPip
  • Reputation: 39
    Admirable
  • 216 posts
  • Location:Brasil

extra qualification ‘FileLoader::’

means that you need to remove the expression between ' '. In this case you can remove FileLoader:: at the problematic line

#154 Guest_mattpl_*

Posted 25 June 2007 - 01:06 AM
Guest_mattpl_*
  • Guests
  • Reputation: 0

I have error to the end compilations, this is link to list:
http://www.wklej.org/id/28720f15c0

help me ;)

#155 hans henrik

Posted 24 December 2008 - 04:04 AM
hans henrik

    [COLOR="Lime"]LaG[/COLOR]

  • Members
  • PipPipPipPipPip
  • Reputation: 10
    Good
  • 445 posts
  • Location:Tjøme, Norway

(yes im aware that im bumping a really old thread)

i have followed this tutorial to-the-letter 3 times using Yurots 0.9.4F (completely untuched)

and i get error.. :(

guess nobody here knows what Socks-5 (on page 6) did?

root@webby:~/YurotsForLinux# make
g++ -I. -I/usr/include/libxml2 -I/usr/include/lua50 -D__linux__ -DEXCEPTION_TRACER -DTLM_BUY_SELL -DTLM_SERVER_SAVE -DTLM_HOUSE_SYSTEM -DBDB_UTEVO_LUX -DWOLV_LOAD_NPC -DBD_HOUSE_WINDOW -DTR_ANTI_AFK -DELEM_VIP_LIST -DTR_SUMMONS -DTRS_GM_INVISIBLE -DTLM_SKULLS_PARTY -DBRN_EXIVA -DSD_BURST_ARROW -DBDB_REPLACE_SPEARS -DBD_ITEM_LOOK -DSM_RELOAD_CONFIG -DJD_DEATH_LIST -DCT_EXANI_TERA -DCVS_DAY_CYCLE -DTJ_MONSTER_BLOOD -DJD_WANDS -D__DEBUG_PLAYERS__ -DYUR_CVS_MODS -DYUR_ICE_RAPIER -DYUR_AOL -DYUR_LOGIN_QUEUE -DYUR_MULTIPLIERS -DYUR_BOH -DYUR_NPC_EXT -DYUR_GUILD_SYSTEM -DYUR_CMD_EXT -DYUR_ITEM_EXT -DYUR_ACT_EXT -DYUR_NO_MONSTER_HEAL -DYUR_PVP_ARENA -DYUR_RINGS_AMULETS -DYUR_CONFIG_CAP -DYUR_FIGHT_MODE -DYUR_READABLES -DYUR_LEARN_SPELLS -DYUR_HEAL_EXHAUST -DYUR_SHUTDOWN -DYUR_ROOKGARD -DYUR_LIGHT_ITEM -DYUR_CLEAN_MAP -DYUR_GM_LOOK -DYUR_PREMIUM_PROMOTION -DYUR_INVISIBLE -DYUR_DRAINS -DYUR_BUILTIN_AAC -Werror -g -O2 -c aac.cpp
In file included from /usr/include/c++/4.3/ext/hash_map:64,
from items.h:27,
from item.h:33,
from container.h:24,
from creature.h:28,
from player.h:25,
from ioplayer.h:27,
from aac.cpp:24:
/usr/include/c++/4.3/backward/backward_warning.h:33:2: error: #warning This file includes at least one deprecated or antiquated header which may be removed without further notice at a future date. Please use a non-deprecated interface with equivalent functionality instead. For a listing of replacement headers and interfaces, consult the file backward_warning.h. To disable this warning use -Wno-deprecated.
cc1plus: warnings being treated as errors
In file included from aac.cpp:23:
ioaccount.h: In member function 'virtual char* IOAccount::getSourceDescription()':
ioaccount.h:35: error: deprecated conversion from string constant to 'char*'
In file included from player.h:24,
from ioplayer.h:27,
from aac.cpp:24:
definitions.h: At global scope:
definitions.h:27: error: conflicting declaration 'typedef long long unsigned int uint64_t'
/usr/include/stdint.h:56: error: 'uint64_t' has a previous declaration as 'typedef long unsigned int uint64_t'
In file included from itemloader.h:24,
from items.h:33,
from item.h:33,
from container.h:24,
from creature.h:28,
from player.h:25,
from ioplayer.h:27,
from aac.cpp:24:
fileloader.h:79: error: extra qualification 'FileLoader::' on member 'writeData'
fileloader.h: In member function 'bool PropStream::GET_STRING(std::string&)':
fileloader.h:176: error: 'memcpy' was not declared in this scope
In file included from container.h:24,
from creature.h:28,
from player.h:25,
from ioplayer.h:27,
from aac.cpp:24:
item.h: At global scope:
item.h:122: error: extra qualification 'Item::' on member 'getText'
In file included from creature.h:34,
from player.h:25,
from ioplayer.h:27,
from aac.cpp:24:
luascript.h:166: error: extra qualification 'LuaScript::' on member 'setField'
In file included from aac.cpp:24:
ioplayer.h: In member function 'virtual char* IOPlayer::getSourceDescription()':
ioplayer.h:35: error: deprecated conversion from string constant to 'char*'
make: *** [aac.o] Error 1


ISP is cheating speed on speedtest.net bigtime! :huh:
Posted Image

#156 Pvls

Posted 05 November 2009 - 02:30 AM
Pvls

    nobody important

  • Members
  • PipPipPipPipPip
  • Reputation: 10
    Good
  • 120 posts
  • Location:Wroclaw

Im also aware of bumping, but the answer is simple, you have to use older gcc for example:

export CC=/usr/bin/gcc-4.1
Microsoft gave you windows, linux will give you whole house

#157 Drakus607

Posted 25 March 2010 - 12:27 AM
Drakus607

    Member

  • Members
  • Pip
  • Reputation: 10
    Good
  • 1 posts

188:/home/drakus/source# make
g++    -c -o commands.o commands.cpp
In file included from container.h:24,
                 from creature.h:28,
                 from commands.h:27,
                 from commands.cpp:26:
item.h:25:30: error: libxml/xmlmemory.h: No such file or directory
item.h:26:27: error: libxml/parser.h: No such file or directory
In file included from /usr/include/c++/4.4/ext/hash_map:59,
                 from items.h:27,
                 from item.h:33,
                 from container.h:24,
                 from creature.h:28,
                 from commands.h:27,
                 from commands.cpp:26:
/usr/include/c++/4.4/backward/backward_warning.h:28:2: warning: #warning This file includes at least one deprecated or antiquated header which may be removed without further notice at a future date. Please use a non-deprecated interface with equivalent functionality instead. For a listing of replacement headers and interfaces, consult the file backward_warning.h. To disable this warning use -Wno-deprecated.
In file included from creature.h:34,
                 from commands.h:27,
                 from commands.cpp:26:
luascript.h:28:17: error: lua.h: No such file or directory
luascript.h:29:21: error: lauxlib.h: No such file or directory
luascript.h:30:20: error: lualib.h: No such file or directory
In file included from itemloader.h:24,
                 from items.h:33,
                 from item.h:33,
                 from container.h:24,
                 from creature.h:28,
                 from commands.h:27,
                 from commands.cpp:26:
fileloader.h:79: error: extra qualification 'FileLoader::' on member 'writeData'
fileloader.h: In member function 'bool PropStream::GET_STRING(std::string&)':
fileloader.h:176: error: 'memcpy' was not declared in this scope
In file included from container.h:24,
                 from creature.h:28,
                 from commands.h:27,
                 from commands.cpp:26:
item.h: At global scope:
item.h:132: error: extra qualification 'Item::' on member 'getText'
item.h:134: error: 'xmlNodePtr' has not been declared
item.h:135: error: 'xmlNodePtr' does not name a type
item.h:210: error: 'xmlNodePtr' has not been declared
item.h:211: error: 'xmlNodePtr' does not name a type
In file included from creature.h:34,
                 from commands.h:27,
                 from commands.cpp:26:
luascript.h:199: error: extra qualification 'LuaScript::' on member 'setField'
In file included from commands.h:27,
                 from commands.cpp:26:
creature.h: In member function 'virtual int Creature::getImmunities() const':
creature.h:157: error: 'class LuaScript' has no member named 'ACCESS_PROTECT'
creature.h: In member function 'void Creature::setNormalSpeed()':
creature.h:236: error: 'class LuaScript' has no member named 'ACCESS_PROTECT'
creature.h: In member function 'int Creature::getNormalSpeed()':
creature.h:245: error: 'class LuaScript' has no member named 'ACCESS_PROTECT'
In file included from commands.cpp:27:
player.h: In member function 'double Player::getCapacity() const':
player.h:210: error: 'class LuaScript' has no member named 'ACCESS_PROTECT'
player.h: In member function 'virtual exp_t Player::getLostExperience()':
player.h:218: error: 'class LuaScript' has no member named 'DIE_PERCENT_EXP'
player.h: In member function 'double Player::getFreeCapacity() const':
player.h:222: error: 'class LuaScript' has no member named 'ACCESS_PROTECT'
player.h: In member function 'virtual bool Player::isAttackable() const':
player.h:301: error: 'class LuaScript' has no member named 'ACCESS_PROTECT'
In file included from monster.h:29,
                 from spawn.h:27,
                 from game.h:33,
                 from npc.h:27,
                 from commands.cpp:28:
monsters.h: At global scope:
monsters.h:196: error: 'xmlNodePtr' has not been declared
monsters.h:197: error: 'xmlNodePtr' has not been declared
In file included from npc.h:27,
                 from commands.cpp:28:
game.h:174: error: extra qualification 'Game::' on member 'globalMsg'
In file included from commands.cpp:30:
actions.h:87: error: expected ';' before '(' token
commands.cpp:43: warning: 'readXMLInteger' initialized and declared 'extern'
commands.cpp:43: error: 'xmlNodePtr' was not declared in this scope
commands.cpp:43: error: expected primary-expression before 'const'
commands.cpp:43: error: expected primary-expression before 'int'
commands.cpp:43: error: initializer expression list treated as compound expression
commands.cpp:120: warning: deprecated conversion from string constant to 'char*'
commands.cpp:120: warning: deprecated conversion from string constant to 'char*'
commands.cpp:120: warning: deprecated conversion from string constant to 'char*'
commands.cpp:120: warning: deprecated conversion from string constant to 'char*'
commands.cpp:120: warning: deprecated conversion from string constant to 'char*'
commands.cpp:120: warning: deprecated conversion from string constant to 'char*'
commands.cpp:120: warning: deprecated conversion from string constant to 'char*'
commands.cpp:120: warning: deprecated conversion from string constant to 'char*'
commands.cpp:120: warning: deprecated conversion from string constant to 'char*'
commands.cpp:120: warning: deprecated conversion from string constant to 'char*'
commands.cpp:120: warning: deprecated conversion from string constant to 'char*'
commands.cpp:120: warning: deprecated conversion from string constant to 'char*'
commands.cpp:120: warning: deprecated conversion from string constant to 'char*'
commands.cpp:120: warning: deprecated conversion from string constant to 'char*'
commands.cpp:120: warning: deprecated conversion from string constant to 'char*'
commands.cpp:120: warning: deprecated conversion from string constant to 'char*'
commands.cpp:120: warning: deprecated conversion from string constant to 'char*'
commands.cpp:120: warning: deprecated conversion from string constant to 'char*'
commands.cpp:120: warning: deprecated conversion from string constant to 'char*'
commands.cpp:120: warning: deprecated conversion from string constant to 'char*'
commands.cpp:120: warning: deprecated conversion from string constant to 'char*'
commands.cpp:120: warning: deprecated conversion from string constant to 'char*'
commands.cpp:120: warning: deprecated conversion from string constant to 'char*'
commands.cpp:120: warning: deprecated conversion from string constant to 'char*'
commands.cpp:120: warning: deprecated conversion from string constant to 'char*'
commands.cpp:120: warning: deprecated conversion from string constant to 'char*'
commands.cpp: In member function 'bool Commands::loadXml(const std::string&)':
commands.cpp:144: error: 'xmlDocPtr' was not declared in this scope
commands.cpp:144: error: expected ';' before 'doc'
commands.cpp:146: error: 'doc' was not declared in this scope
commands.cpp:148: error: 'xmlNodePtr' was not declared in this scope
commands.cpp:148: error: expected ';' before 'root'
commands.cpp:149: error: 'root' was not declared in this scope
commands.cpp:149: error: 'xmlDocGetRootElement' was not declared in this scope
commands.cpp:151: error: ISO C++ forbids declaration of 'type name' with no type
commands.cpp:151: error: ISO C++ forbids declaration of 'type name' with no type
commands.cpp:151: error: expected primary-expression before 'const'
commands.cpp:151: error: expected ')' before 'const'
commands.cpp:155: error: expected ')' before ';' token
commands.cpp:157: error: 'p' was not declared in this scope
commands.cpp:162: error: ISO C++ forbids declaration of 'type name' with no type
commands.cpp:162: error: ISO C++ forbids declaration of 'type name' with no type
commands.cpp:162: error: expected primary-expression before 'const'
commands.cpp:162: error: expected ')' before 'const'
commands.cpp:167: error: 'readXMLInteger' cannot be used as a function
commands.cpp:184: error: 'xmlFree' was not declared in this scope
commands.cpp:192: error: 'xmlFreeDoc' was not declared in this scope
commands.cpp: In member function 'bool Commands::showRs(Creature*, const std::string&, const std::string&)':
commands.cpp:751: error: 'class Player' has no member named 'skullType'
commands.cpp:751: error: 'SKULL_RED' was not declared in this scope
commands.cpp:754: error: 'class Player' has no member named 'skullTicks'
commands.cpp: At global scope:
commands.cpp:1476: error: no 'bool Commands::listaVip(Creature*, const std::string&, const std::string&)' member function declared in class 'Commands'
make: *** [commands.o] Error 1

What must I do with it? ;x

#158 karolciaaa

Posted 12 April 2010 - 04:44 AM
karolciaaa

    Full Member

  • Members
  • PipPipPipPipPip
  • Reputation: 10
    Good
  • 196 posts
  • Location:P(r)oland

karol@karol-laptop:~/Pulpit/new$ make

g++ -I. -I/usr/include/libxml2  -I/usr/include/lua50 -D__linux__ -D__DEBUG__ -D__EXCEPTION_TRACER__ -D WANDS_JIDDO -D_WCK_BBK_BORDER_FIX -DANTY_DDOS -D__online__ -DUCB_SUSPEND_SYSTEM -D__MIZIAK_BLESSING__ -D__MIZIAK_ADDS__ -DEXCEPTION_TRACER -DTLM_BUY_SELL -DTLM_SERVER_SAVE -DTLM_HOUSE_SYSTEM -DBDB_UTEVO_LUX -DWOLV_LOAD_NPC -DBD_HOUSE_WINDOW -DTR_ANTI_AFK -DELEM_VIP_LIST -DTR_SUMMONS -DTRS_GM_INVISIBLE -DTLM_SKULLS_PARTY -DBRN_EXIVA -DSD_BURST_ARROW -DBDB_REPLACE_SPEARS -DBD_ITEM_LOOK -DSM_RELOAD_CONFIG -DJD_DEATH_LIST -DCT_EXANI_TERA -DCVS_DAY_CYCLE -DTJ_MONSTER_BLOOD -DJD_WANDS -D__DEBUG_PLAYERS__ -DYUR_CVS_MODS -DYUR_ICE_RAPIER -DYUR_AOL -DYUR_LOGIN_QUEUE -DYUR_MULTIPLIERS -DYUR_BOH -DYUR_NPC_EXT -DYUR_GUILD_SYSTEM -DYUR_CMD_EXT -DYUR_ITEM_EXT -DYUR_ACT_EXT -DYUR_NO_MONSTER_HEAL -DYUR_PVP_ARENA -DYUR_RINGS_AMULETS -DYUR_CONFIG_CAP -DYUR_FIGHT_MODE -DYUR_READABLES -DYUR_LEARN_SPELLS -DYUR_HEAL_EXHAUST -DYUR_SHUTDOWN -DYUR_ROOKGARD -DYUR_LIGHT_ITEM -DYUR_CLEAN_MAP -DYUR_GM_LOOK -DYUR_HIGH_LEVELS -DYUR_PREMIUM_PROMOTION -DYUR_INVISIBLE -DYUR_DRAINS -DYUR_BUILTIN_AAC -Werror -g -O2 -c actions.cpp

In file included from /usr/include/c++/4.4/ext/hash_map:59,

                 from items.h:27,

                 from item.h:33,

                 from container.h:24,

                 from creature.h:28,

                 from player.h:25,

                 from actions.cpp:24:

/usr/include/c++/4.4/backward/backward_warning.h:28:2: error: #warning This file includes at least one deprecated or antiquated header which may be removed without further notice at a future date. Please use a non-deprecated interface with equivalent functionality instead. For a listing of replacement headers and interfaces, consult the file backward_warning.h. To disable this warning use -Wno-deprecated.

In file included from itemloader.h:24,

                 from items.h:33,

                 from item.h:33,

                 from container.h:24,

                 from creature.h:28,

                 from player.h:25,

                 from actions.cpp:24:

fileloader.h:79: error: extra qualification ‘FileLoader::’ on member ‘writeData’

fileloader.h: In member function ‘bool PropStream::GET_STRING(std::string&)’:

fileloader.h:176: error: ‘memcpy’ was not declared in this scope

In file included from container.h:24,

                 from creature.h:28,

                 from player.h:25,

                 from actions.cpp:24:

item.h: At global scope:

item.h:126: error: extra qualification ‘Item::’ on member ‘getText’

In file included from creature.h:34,

                 from player.h:25,

                 from actions.cpp:24:

luascript.h:149: error: extra qualification ‘LuaScript::’ on member ‘setField’

cc1plus: warnings being treated as errors

actions.cpp: In member function ‘bool Actions::luaWalk(Player*, const Position&, short unsigned int, unsigned int, unsigned int)’:

actions.cpp:220: error: large integer implicitly truncated to unsigned type

actions.cpp: In member function ‘bool Actions::luaWalkOff(Player*, const Position&, short unsigned int, unsigned int, unsigned int)’:

actions.cpp:235: error: large integer implicitly truncated to unsigned type

make: *** [actions.o] Błąd 1

karol@karol-laptop:~/Pulpit/new$ clear



karol@karol-laptop:~/Pulpit/new$ make

g++ -I. -I/usr/include/libxml2  -I/usr/include/lua50 -D__linux__ -D__DEBUG__ -D__EXCEPTION_TRACER__ -D WANDS_JIDDO -D_WCK_BBK_BORDER_FIX -DANTY_DDOS -D__online__ -DUCB_SUSPEND_SYSTEM -D__MIZIAK_BLESSING__ -D__MIZIAK_ADDS__ -DEXCEPTION_TRACER -DTLM_BUY_SELL -DTLM_SERVER_SAVE -DTLM_HOUSE_SYSTEM -DBDB_UTEVO_LUX -DWOLV_LOAD_NPC -DBD_HOUSE_WINDOW -DTR_ANTI_AFK -DELEM_VIP_LIST -DTR_SUMMONS -DTRS_GM_INVISIBLE -DTLM_SKULLS_PARTY -DBRN_EXIVA -DSD_BURST_ARROW -DBDB_REPLACE_SPEARS -DBD_ITEM_LOOK -DSM_RELOAD_CONFIG -DJD_DEATH_LIST -DCT_EXANI_TERA -DCVS_DAY_CYCLE -DTJ_MONSTER_BLOOD -DJD_WANDS -D__DEBUG_PLAYERS__ -DYUR_CVS_MODS -DYUR_ICE_RAPIER -DYUR_AOL -DYUR_LOGIN_QUEUE -DYUR_MULTIPLIERS -DYUR_BOH -DYUR_NPC_EXT -DYUR_GUILD_SYSTEM -DYUR_CMD_EXT -DYUR_ITEM_EXT -DYUR_ACT_EXT -DYUR_NO_MONSTER_HEAL -DYUR_PVP_ARENA -DYUR_RINGS_AMULETS -DYUR_CONFIG_CAP -DYUR_FIGHT_MODE -DYUR_READABLES -DYUR_LEARN_SPELLS -DYUR_HEAL_EXHAUST -DYUR_SHUTDOWN -DYUR_ROOKGARD -DYUR_LIGHT_ITEM -DYUR_CLEAN_MAP -DYUR_GM_LOOK -DYUR_HIGH_LEVELS -DYUR_PREMIUM_PROMOTION -DYUR_INVISIBLE -DYUR_DRAINS -DYUR_BUILTIN_AAC -Werror -g -O2 -c actions.cpp

In file included from /usr/include/c++/4.4/ext/hash_map:59,

                 from items.h:27,

                 from item.h:33,

                 from container.h:24,

                 from creature.h:28,

                 from player.h:25,

                 from actions.cpp:24:

/usr/include/c++/4.4/backward/backward_warning.h:28:2: error: #warning This file includes at least one deprecated or antiquated header which may be removed without further notice at a future date. Please use a non-deprecated interface with equivalent functionality instead. For a listing of replacement headers and interfaces, consult the file backward_warning.h. To disable this warning use -Wno-deprecated.

In file included from itemloader.h:24,

                 from items.h:33,

                 from item.h:33,

                 from container.h:24,

                 from creature.h:28,

                 from player.h:25,

                 from actions.cpp:24:

fileloader.h:79: error: extra qualification ‘FileLoader::’ on member ‘writeData’

fileloader.h: In member function ‘bool PropStream::GET_STRING(std::string&)’:

fileloader.h:176: error: ‘memcpy’ was not declared in this scope

In file included from container.h:24,

                 from creature.h:28,

                 from player.h:25,

                 from actions.cpp:24:

item.h: At global scope:

item.h:126: error: extra qualification ‘Item::’ on member ‘getText’

In file included from creature.h:34,

                 from player.h:25,

                 from actions.cpp:24:

luascript.h:149: error: extra qualification ‘LuaScript::’ on member ‘setField’

cc1plus: warnings being treated as errors

actions.cpp: In member function ‘bool Actions::luaWalk(Player*, const Position&, short unsigned int, unsigned int, unsigned int)’:

actions.cpp:220: error: large integer implicitly truncated to unsigned type

actions.cpp: In member function ‘bool Actions::luaWalkOff(Player*, const Position&, short unsigned int, unsigned int, unsigned int)’:

actions.cpp:235: error: large integer implicitly truncated to unsigned type

make: *** [actions.o] Błąd 1

karol@karol-laptop:~/Pulpit/new$ 



#159 Marceklos

Posted 18 September 2015 - 11:47 PM
Marceklos

    Member

  • Members
  • Pip
  • Reputation: 10
    Good
  • 3 posts
  • Location:frutal mg brasil

In file included from /usr/include/c++/4.8/ext/hash_map:60:0,
                 from items.h:27,
                 from item.h:33,
                 from container.h:24,
                 from creature.h:28,
                 from player.h:25,
                 from actions.cpp:24:
/usr/include/c++/4.8/backward/backward_warning.h:32:2: warning: #warning This file includes at least one deprecated or antiquated header which may be removed without further notice at a future date. Please use a non-deprecated interface with equivalent functionality instead. For a listing of replacement headers and interfaces, consult the file backward_warning.h. To disable this warning use -Wno-deprecated. [-Wcpp]
 #warning \
  ^
In file included from itemloader.h:24:0,
                 from items.h:33,
                 from item.h:33,
                 from container.h:24,
                 from creature.h:28,
                 from player.h:25,
                 from actions.cpp:24:
fileloader.h:79:14: error: extra qualification ‘FileLoader::’ on member ‘writeData’ [-fpermissive]
  inline bool FileLoader::writeData(const void* data, int size, bool unescape){
              ^
fileloader.h: In member function ‘bool PropStream::GET_STRING(std::string&)’:
fileloader.h:176:25: error: ‘memcpy’ was not declared in this scope
   memcpy(str, p, str_len);
                         ^
In file included from container.h:24:0,
                 from creature.h:28,
                 from player.h:25,
                 from actions.cpp:24:
item.h: At global scope:
item.h:122:14: error: extra qualification ‘Item::’ on member ‘getText’ [-fpermissive]
  std::string Item::getText();
              ^
In file included from creature.h:34:0,
                 from player.h:25,
                 from actions.cpp:24:
luascript.h:161:8: error: extra qualification ‘LuaScript::’ on member ‘setField’ [-fpermissive]
   void LuaScript::setField (const char *index, int value);
        ^
In file included from player.h:25:0,
                 from actions.cpp:24:
creature.h: In member function ‘virtual int Creature::getImmunities() const’:
creature.h:153:25: error: ‘class LuaScript’ has no member named ‘ACCESS_PROTECT’
   if(access >= g_config.ACCESS_PROTECT) 
                         ^
creature.h: In member function ‘void Creature::setNormalSpeed()’:
creature.h:231:25: error: ‘class LuaScript’ has no member named ‘ACCESS_PROTECT’
   if(access >= g_config.ACCESS_PROTECT){
                         ^
creature.h: In member function ‘int Creature::getNormalSpeed()’:
creature.h:240:25: error: ‘class LuaScript’ has no member named ‘ACCESS_PROTECT’
   if(access >= g_config.ACCESS_PROTECT){     
                         ^
In file included from actions.cpp:24:0:
player.h: In member function ‘double Player::getCapacity() const’:
player.h:183:24: error: ‘class LuaScript’ has no member named ‘ACCESS_PROTECT’
   if(access < g_config.ACCESS_PROTECT) {
                        ^
player.h: In member function ‘virtual exp_t Player::getLostExperience()’:
player.h:191:32: error: ‘class LuaScript’ has no member named ‘DIE_PERCENT_EXP’
   return experience * g_config.DIE_PERCENT_EXP / 100;
                                ^
player.h: In member function ‘double Player::getFreeCapacity() const’:
player.h:195:24: error: ‘class LuaScript’ has no member named ‘ACCESS_PROTECT’
   if(access < g_config.ACCESS_PROTECT) {
                        ^
player.h: In member function ‘virtual bool Player::isAttackable() const’:
player.h:277:64: error: ‘class LuaScript’ has no member named ‘ACCESS_PROTECT’
  virtual bool isAttackable() const { return (access < g_config.ACCESS_PROTECT); };
                                                                ^
actions.cpp: In constructor ‘ActionScript::ActionScript(Game*, const string&, const string&)’:
actions.cpp:452:54: error: cast from ‘ActionScript*’ to ‘int’ loses precision [-fpermissive]
  this->setGlobalNumber("addressOfActionScript", (int)this);
                                                      ^
actions.cpp: In static member function ‘static ActionScript* ActionScript::getActionScript(lua_State*)’:
actions.cpp:715:42: warning: cast to pointer from integer of different size [-Wint-to-pointer-cast]
  ActionScript* myaction = (ActionScript*)val;
                                          ^
make: ** [actions.o] Erro 1






0 user(s) are reading this topic

0 members, 0 guests, 0 anonymous users